primary
preferred label: primär beteiligte Person @de

host
type: Concept
in scheme: scheme
preferred label: Gastgeber @de
broader: primary
change note:
  comment: initial version
  created: 2022-08-24T09:46:33+00:00
  creator: Michael Matile
scope note: Meint den Gastgeber bei Treffen von Personen @de
change note:
  creator: Michael Matile
  modified: 2022-08-24T09:48:57+00:00