Artwork by technique
preferred label: Kunstwerk nach Technik @de

Painter
preferred label: Maler @de

Painting
type: Concept
in scheme: scheme
preferred label: Gemälde @de
alternative label: Peinture @fr
alternative label: Pittura @it
broader: Artwork by technique
related: Painter
change note:
  creator: Michael Matile
  modified: 2021-10-19T07:40:39+00:00
change note:
  comment: initial version
  created: 2021-06-02T08:18:54+00:00
  creator: Sophie Guermann
scope note: Bezeichnet ein gemaltes und in der Regel transportables Kunstwerk. @de
change note:
  creator: Michael Matile
  modified: 2022-01-24T14:30:05+00:00