Beischrift
preferred label: Inscription @en

Monogramm
preferred label: Monogram @en

Signatur
type: Concept
in scheme: scheme
preferred label: Signature @en
alternative label: Unterschrift
alternative label: Firma @it
broader: Beischrift
related: Monogramm
change note:
  comment: initial version @en
  created: 2021-09-13T15:09:56+00:00
  creator: Sophie Guermann
change note:
  creator: Michael Matile
  modified: 2022-01-24T15:13:48+00:00
scope note: Gibt den Namen des Künstlers, des Stechers, des Druckers oder des Herausgebers an.