People by activity, in commerce and business
preferred label: Personen nach Tätigkeit, in Handel und Gewerbe @de

Printshop
preferred label: Druckerei @de

Printseller
type: Concept
in scheme: scheme
preferred label: Kupferstichhändler @de
alternative label: sold by @en
alternative label: sould by @en
alternative label: Kupferstich-Handlung @de
alternative label: Marchand d'estampes
alternative label: on le vend
alternative label: on trouve a vendre
alternative label: se trouve
alternative label: se trouvent
alternative label: se vand
alternative label: se vande
alternative label: se vend
alternative label: Rivenditore di stampe @it
alternative label: se vendano @it
alternative label: si vende @it
alternative label: si vendeno per @it
alternative label: si vendono da @it
alternative label: prostant @la
alternative label: prostat @la
alternative label: sunt venales in aedibus @la
alternative label: venditor @la
alternative label: vendono @la
alternative label: venduntur @la
alternative label: venundant @la
broader: People by activity, in commerce and business
related: Printshop
change note:
  creator: Michael Matile
  modified: 2022-01-24T15:58:57+00:00
change note:
  comment: initial version @en
  created: 2021-05-25T11:04:36+00:00
  creator: Sophie Guermann
change note:
  creator: Sophie Guermann
  modified: 2021-06-01T09:39:27+00:00
change note:
  creator: Sophie Guermann
  modified: 2021-06-14T10:05:21+00:00
change note:
  creator: Sarah Amsler
  modified: 2021-06-14T13:15:12+00:00
scope note: Bezeichnet einen Händler, der Druckgraphik verkauft. @de
change note:
  creator: Michael Matile
  modified: 2022-02-09T10:20:29+00:00
change note:
  creator: Florian Kräutli
  modified: 2022-08-24T14:26:33+00:00
related match: E12 Production