Privileges
preferred label: Privilegien @de

With permission
type: Concept
in scheme: scheme
preferred label: Mit Genehmigung @de
alternative label: Avec la permission @fr
alternative label: Con il permesso @it
alternative label: permissu
alternative label: s.p.
alternative label: s. per.
alternative label: sp. lic.
alternative label: sup. per.
alternative label: sup. perm.
alternative label: sup. permiss.
alternative label: sup[er]. p[er]m.
alternative label: sup[eriorum] p[er]missu
alternative label: sup[er]ior[um] p[er]missu
alternative label: supe. permissu
alternative label: super. p[er]m.
alternative label: super. perm.
alternative label: superior. licentia
alternative label: superior. perm.
alternative label: superior. permissu
alternative label: superiorum authoritate
alternative label: superiorum licentia
alternative label: superioru. licentia
alternative label: superiorum permissu
alternative label: superiorum pprmiss.
broader: Privileges
change note:
  creator: Sophie Guermann
  modified: 2021-09-14T08:29:00+00:00
change note:
  creator: Sophie Guermann
  modified: 2021-06-14T10:11:11+00:00
change note:
  comment: initial version @en
  created: 2021-06-14T10:09:22+00:00
  creator: Sophie Guermann
change note:
  creator: Sophie Guermann
  modified: 2021-09-14T08:26:21+00:00
change note:
  creator: Michael Matile
  modified: 2022-02-09T10:13:28+00:00
scope note: Meint, dass das Werk mit Erlaubnis einer politischen Instanz gedruckt wurde. @de