Aus der Werkstatt
type: Concept
in scheme: scheme
preferred label: From the workshop @en
alternative label: Werkstattarbeit
alternative label: Arbeit der Werkstatt
alternative label: De l'atelier @fr
alternative label: Dal workshop @it
alternative label: Ex officina @la
broader: BSO Thesaurus
change note:
  creator: Sophie Guermann
  modified: 2021-09-13T14:08:33+00:00
change note:
  comment: initial version @en
  created: 2021-08-01T11:08:54+00:00
  creator: Sophie Guermann
change note:
  creator: Michael Matile
  modified: 2022-01-24T14:32:50+00:00
scope note: Bezeichnet ein Werk, das einem oder mehreren Werkstattmitarbeitern eines Meisters/Werkstattoberhauptes zugeschrieben wird.