Acroteria
preferred label: Akroterien @de

Ship acroteria
type: Concept
in scheme: scheme
preferred label: Schiffsakroterien @de
broader: Acroteria
change note:
  comment: initial version
  created: 2021-05-26T09:53:19+00:00
  creator: Elena Chestnova
definition: This comes up on p. 27 vol. 1, ed. 1 of Style in an illustration.
change note:
  creator: Elena Chestnova
  modified: 2022-06-17T12:03:42+00:00
notation: THING0388