Inscription
preferred label: Beischrift @de

Trial proof
preferred label: Probedruck @de

State before adding text
type: Concept
in scheme: scheme
preferred label: Probedruck vor der Schrift @de
alternative label: without text
alternative label: without any text
alternative label: without letterpress
alternative label: Zustand vor dem Einfügen von Text @de
alternative label: ohne Text @de
alternative label: État avant l'ajout du texte @fr
alternative label: avant la lettre @fr
alternative label: avant toute lettre @fr
alternative label: sans aucune lettre @fr
alternative label: sans texte @fr
alternative label: sans lettre @fr
alternative label: Stato prima di aggiungere il testo @it
alternative label: senza lettera @it
alternative label: senza testo @it
broader: Inscription
related: Trial proof
change note:
  creator: Michael Matile
  modified: 2022-01-24T15:23:27+00:00
change note:
  creator: Sophie Guermann
  modified: 2021-09-14T06:19:48+00:00
change note:
  comment: initial version
  created: 2021-08-01T11:00:53+00:00
  creator: Sophie Guermann
change note:
  creator: Sophie Guermann
  modified: 2021-09-14T06:14:03+00:00
change note:
  creator: Michael Matile
  modified: 2022-01-24T15:15:41+00:00
scope note: Bezeichnet einen Probedruck/Druckzustand vor der Hinzufügung von Beischriften. @de
change note:
  creator: Michael Matile
  modified: 2022-02-09T10:24:06+00:00