Inscription
preferred label: Beischrift @de

Signature
preferred label: Signatur @de

Monogram
type: Concept
in scheme: scheme
preferred label: Monogramm @de
alternative label: Monogramme @fr
alternative label: Monogramma @it
broader: Inscription
related: Signature
change note:
  creator: Sophie Guermann
  modified: 2021-09-14T06:59:32+00:00
change note:
  creator: Sophie Guermann
  modified: 2021-09-13T14:44:51+00:00
change note:
  comment: initial version
  created: 2021-05-19T06:27:11+00:00
  creator: Sophie Guermann
change note:
  creator: Michael Matile
  modified: 2022-01-24T15:10:46+00:00
scope note: Abgekürzte Signatur eines Künstlers, Stechers oder Druckers, die sich aus den Initialen des Namens zusammensetzt. @de