Item
type: Concept
in scheme: scheme
preferred label: Dokument @de
broader: ISAD-G Types
change note:
  creator: Thomas Hänsli
  modified: 2021-05-05T14:17:07+00:00
change note:
  comment: initial version
  created: 2021-05-05T14:12:05+00:00
  creator: Thomas Hänsli
definition: smallest, intellectualy indivisible unit
change note:
  creator: Thomas Hänsli
  modified: 2021-05-05T14:18:15+00:00