Aquatinter
preferred label: Aquatintaradierer @de

Etching
preferred label: Radierung @de

Aquatint
type: Concept
in scheme: scheme
preferred label: Aquatintaradierung @de
alternative label: Etching with aquatint
alternative label: Aquatinta @de
alternative label: Aquatinte @fr
alternative label: Acquatinta @it
alternative label: aq: tinta @la
alternative label: aqua tinta @la
alternative label: aquatinta @la
related: Aquatinter
broader: Etching
change note:
  comment: initial version
  created: 2021-10-05T13:00:13+00:00
  creator: Michael Matile
scope note: Bezeichnet eine Radierung, welche mittels Ätzen in Aquatintatechnik hergestellt wurde. @de
change note:
  creator: Michael Matile
  modified: 2022-01-24T14:28:13+00:00