Privileges
preferred label: Privilegien @de

With grace and privilege
type: Concept
in scheme: scheme
preferred label: Mit Gnade und Privileg @de
alternative label: Avec grâce et privilège @fr
alternative label: Con grazia e privilegio @it
alternative label: cum grat. et priv.
alternative label: cum gratia & privil.
alternative label: cum gratia & privilegio
alternative label: cum gratia et priv.
alternative label: cum gratia et privilegio
broader: Privileges
change note:
  comment: initial version @en
  created: 2021-09-14T14:13:53+00:00
  creator: Sophie Guermann
change note:
  creator: Michael Matile
  modified: 2022-01-26T13:14:24+00:00
scope note: Bezeichnet gedruckte Werke, für welche von einer politischen Instanz ein Druckprivileg ausgestellt wurde. @de