Beischrift
preferred label: Inscription @en

Pflichtexemplar
type: Concept
in scheme: scheme
preferred label: Legal deposit @en
alternative label: Gesetzliche Hinterlegung eines gedruckten Produkts
alternative label: Dépôt légal @fr
alternative label: Deposito legale @it
broader: Beischrift
change note:
  creator: Michael Matile
  modified: 2022-01-24T15:32:01+00:00
change note:
  comment: initial version @en
  created: 2021-06-14T10:06:46+00:00
  creator: Sophie Guermann
scope note: Ein Pflichtexemplar ist ein Exemplar einer Veröffentlichung, das aufgrund eines Gesetzes oder einer anderen öffentlich-rechtlichen Vorschrift von seinem Verleger (oder seltener vom Hersteller) an bestimmte Bibliotheken des Landes oder der Region, in der es verlegt wurde, abgegeben werden muss.
change note:
  creator: Michael Matile
  modified: 2022-01-24T15:40:02+00:00