theoretical terms
preferred label: theoretische Begriffe @de

Finery
type: Concept
in scheme: scheme
preferred label: Putz (Schmuck) @de
broader: theoretical terms
change note:
  creator: Elena Chestnova
  modified: 2021-05-26T11:01:24+00:00
change note:
  comment: initial version
  created: 2021-05-26T10:53:54+00:00
  creator: Elena Chestnova
definition: Semper uses "Putz" both in the sense of "finery" and in the sense of "stucco". This entry corresponds to the former.
change note:
  creator: Elena Chestnova
  modified: 2022-06-12T14:31:16+00:00
notation: THING0378