Proofs
preferred label: Andrucke @de

Artist's proof
type: Concept
in scheme: scheme
preferred label: Druck des Künstlers @de
alternative label: AP
alternative label: Épreuve d'artiste @fr
alternative label: Prova d'artista @it
broader: Proofs
change note:
  creator: Sophie Guermann
  modified: 2021-06-14T09:51:49+00:00
change note:
  comment: initial version
  created: 2021-06-14T09:49:51+00:00
  creator: Sophie Guermann
change note:
  creator: Michael Matile
  modified: 2022-01-26T13:06:17+00:00
scope note: Analog dem 'Printer's proof' ist hier ein Druck aus der für den Künstler reservierten Auflage gemeint. Der Begriff sollte nur im Fall von handschriftlich nummerierter Druckgrafik verwendet werden. @de