Rubber (material)
type: Concept
in scheme: scheme
preferred label: Gummi @de
alternative label: vulcanite
alternative label: Kautschuk @de
broader: Materials by composition
change note:
  creator: Elena Chestnova
  modified: 2021-05-26T12:05:49+00:00
change note:
  creator: Elena Chestnova
  modified: 2021-05-26T12:04:28+00:00
change note:
  creator: Elena Chestnova
  modified: 2021-05-06T13:41:30+00:00
change note:
  comment: initial version
  created: 2021-04-16T09:42:47+00:00
  creator: Elena Chestnova
change note:
  creator: Elena Chestnova
  modified: 2021-04-16T09:59:29+00:00
change note:
  creator: Elena Chestnova
  modified: 2021-04-16T10:00:55+00:00
definition: Semper describes rubber as the “ape of useful materials” that “adapts and lends itself to every purpose”. He speaks of “its extraordinary uniformity of mass, its mild black colour, the smoothness of its flawless polished surface, and finally a solidity and immutability”. Rubber applications that Semper experienced in his day were much wider than what we see today (e.g. vulcanite, rubber velvet, etc).
example: “shoes with fine vents that were impervious to water but allowed perspiration to evaporate; clothing of every kind; waterproof coverings […] for exterior wall dressings; maps; tents; pontoons; lifeboats; life vests; diving suits; suspension rings (instead of springs) for carriages, mounted on the chassis; picture frames; solid or upholstered furniture; saddle racks; book bindings; small spigots for barrels; buttons; watering cans; gun butts; saber sheaths; cartridge cases; spools and other machine parts; combs for personal care and for weaving; shiny spades; ribs for corsets and spokes for umbrellas and parasols; walking sticks; exceptionally thin, flexible and durable spectacle frames; handles for knives and every kind of tool; rulers for drawing, divided into millimetres; haut-reliefs with and without gilding; jewelry items, little boxes, and every kind of knick-knack.”
change note:
  creator: Elena Chestnova
  modified: 2022-05-18T19:02:13+00:00
notation: THING0302