Lithograf
preferred label: Lithographer @en

Chromolithograf
type: Concept
in scheme: scheme
preferred label: Chromolithographer @en
alternative label: Chromolithograph
alternative label: Chromolithographe @fr
alternative label: Cromolitografo @it
alternative label: chromolith. @la
broader: Lithograf
change note:
  comment: initial version @en
  created: 2021-05-25T09:48:19+00:00
  creator: Sophie Guermann
change note:
  creator: Michael Matile
  modified: 2022-01-24T14:20:49+00:00
scope note: Bezeichnet den Lithografen bei der Herstellung einer Chromolothografie.