primary
preferred label: primär beteiligte Person @de

teacher
type: Concept
in scheme: scheme
preferred label: Lehrer @de
broader: primary
change note:
  comment: initial version
  created: 2022-08-24T09:49:38+00:00
  creator: Michael Matile
scope note: Mein den Lehrer, bei dem ein Schüler in die Lehre gegangen ist. @de