Privileges
preferred label: Privilegien @de

With imperial privilege
type: Concept
in scheme: scheme
preferred label: Mit kaiserlichem Privileg @de
alternative label: Avec privilège impérial @fr
alternative label: Con il privilegio imperiale @it
alternative label: S. Caes. M.tis @la
alternative label: Sac. Caes. Mai. @la
broader: Privileges
change note:
  creator: Sophie Guermann
  modified: 2021-06-14T10:16:43+00:00
change note:
  comment: initial version
  created: 2021-06-14T09:04:45+00:00
  creator: Sophie Guermann
change note:
  creator: Michael Matile
  modified: 2022-01-26T13:33:41+00:00
scope note: Bezeichnet gedruckte Werke, für welche ein kaiserliches Druckprivileg ausgestellt wurde. @de