Artists by activity, medium or work type
preferred label: Künstler nach Tätigkeit, Medium oder Werkart @de

Inventor
type: Concept
in scheme: scheme
preferred label: Erfinder @de
alternative label: designed by @en
alternative label: invented @en
alternative label: Zeichner @de
alternative label: Inventeur @fr
alternative label: de l’invention de @fr
alternative label: faits par @fr
alternative label: inventé par @fr
alternative label: inventées par @fr
alternative label: inventés par @fr
alternative label: inventeur @fr
alternative label: inventez par @fr
alternative label: Inventore @it
alternative label: auct.
alternative label: auctor
alternative label: auctore
alternative label: comp.
alternative label: compo.
alternative label: composuit
alternative label: cop.
alternative label: depictae a
alternative label: figurator
alternative label: figuratore
alternative label: fingebat
alternative label: in.
alternative label: inf.
alternative label: inue.
alternative label: inuen.
alternative label: inv.
alternative label: inv.t
alternative label: inve.
alternative label: inven.
alternative label: inven.t
alternative label: inveniebat
alternative label: invenit
alternative label: invent.
alternative label: inventa
alternative label: inventor
alternative label: invet.
alternative label: invintor
alternative label: jnu. [= inv.]
alternative label: pictae a
broader: Artists by activity, medium or work type
change note:
  creator: Florian Kräutli
  modified: 2022-03-25T11:57:51+00:00
change note:
  comment: initial version @en
  created: 2021-05-25T08:26:03+00:00
  creator: Sophie Guermann
change note:
  creator: Sophie Guermann
  modified: 2021-06-28T06:12:07+00:00
change note:
  creator: Sophie Guermann
  modified: 2021-09-13T14:21:52+00:00
change note:
  creator: Sophie Guermann
  modified: 2021-09-14T13:08:58+00:00
change note:
  creator: Sophie Guermann
  modified: 2021-09-14T13:30:20+00:00
change note:
  creator: Michael Matile
  modified: 2021-10-30T12:09:10+00:00
scope note: Der Zeichner gilt in der Druckgraphik als jener, der die Vorlage für die Druckgraphik liefert und der in der Regel als Erfinder einer Komposition betrachtet wird. @de
change note:
  creator: Florian Kräutli
  modified: 2022-03-25T12:10:09+00:00
related match: E65 Creation