BSO Smapshot
type: Concept
top concept of: scheme
in scheme: scheme
narrower: pose
change note:
  comment: initial version
  created: 2021-10-26T13:33:26+00:00
  creator: Florian Kräutli
definition: A vocabulary of terms based on the data obtained from the Smapshot API