Author
preferred label: Schriftsteller @de

Travel writer
type: Concept
in scheme: scheme
preferred label: Reiseschriftsteller @de
alternative label: Auteur de voyage @fr
alternative label: Autore di viaggi @it
broader: Author
related: Author
change note:
  creator: Michael Matile
  modified: 2022-01-24T16:18:03+00:00
change note:
  comment: initial version
  created: 2021-05-19T09:09:58+00:00
  creator: Sophie Guermann
scope note: Bezeichnet wird damit die Person, von welcher der Reisebericht bzw. der Text eines Reisführers stammt. @de
change note:
  creator: Michael Matile
  modified: 2022-01-24T16:25:01+00:00
change note:
  creator: Florian Kräutli
  modified: 2022-08-24T14:27:19+00:00
related match: E65 Creation