After
preferred label: Nach @de

After life
type: Concept
in scheme: scheme
preferred label: Nach dem Leben @de
alternative label: From the life @en
alternative label: Nach der Natur @de
alternative label: D'après nature @fr
alternative label: sur le naturel @fr
alternative label: vu @fr
alternative label: au vif @fr
alternative label: ad nat.
alternative label: ad viv.
alternative label: ad vivum
alternative label: ap. nat.
alternative label: locum ad viv. del.
alternative label: n.d. Nat.
alternative label: sec. nat.
broader: After
related: After
change note:
  creator: Michael Matile
  modified: 2021-10-19T06:13:56+00:00
change note:
  comment: initial version @en
  created: 2021-07-26T06:44:54+00:00
  creator: Sophie Guermann
change note:
  creator: Sophie Guermann
  modified: 2021-07-26T06:49:30+00:00
change note:
  creator: Sophie Guermann
  modified: 2021-08-01T10:55:49+00:00
change note:
  creator: Sophie Guermann
  modified: 2021-08-01T11:03:38+00:00
change note:
  creator: Sophie Guermann
  modified: 2021-08-01T11:22:34+00:00
change note:
  creator: Sophie Guermann
  modified: 2021-08-01T12:34:39+00:00
change note:
  creator: Sophie Guermann
  modified: 2021-08-01T12:39:42+00:00
change note:
  creator: Sophie Guermann
  modified: 2021-08-01T12:41:23+00:00
change note:
  creator: Sophie Guermann
  modified: 2021-09-16T08:27:27+00:00
scope note: Hält fest, dass das Werk direkt nach der Natur/dem lebenden Motiv entstanden ist. @en
change note:
  creator: Michael Matile
  modified: 2022-01-24T13:25:52+00:00