Privileges
preferred label: Privilegien @de

Without privileges
type: Concept
in scheme: scheme
preferred label: Ohne Privilegien @de
alternative label: Sans privilèges @fr
alternative label: s.g.d.g. @fr
alternative label: Senza privilegi @it
broader: Privileges
change note:
  comment: initial version
  created: 2021-09-20T07:12:55+00:00
  creator: Sophie Guermann
change note:
  creator: Michael Matile
  modified: 2022-01-26T13:40:33+00:00
scope note: Bezeichnet ein gedrucktes Werk, das ohne Druckprivileg gedruckt wurde.