Radieren
preferred label: etching @en

Druckgrafik machen
preferred label: printmaking @en

mit Säure direkt ätzen
type: Concept
in scheme: scheme
preferred label: brush etching @en
alternative label: Direktätzung
alternative label: Pinselätzung
alternative label: graver à la manière de lavis @fr
alternative label: Incisione a pennello @it
related: Radieren
broader: Druckgrafik machen
change note:
  creator: Michael Matile
  modified: 2022-01-24T10:37:54+00:00
change note:
  comment: Initiale Version
  created: 2021-10-31T12:12:05+00:00
  creator: Michael Matile
scope note: Bezeichnet die Technik, mit dem Pinsel Ätzsäure direkt auf die Druckplatte aufzutragen und so eine Direktätzung der Platten zu ermöglichen. Das Verfahren wurde häufig als druckgraphisches Äquivalent für die Darstellung von Lavierungen aller Art verwendet (z.B. beim Faksimile-Druck nach Handzeichnungen).
change note:
  creator: Michael Matile
  modified: 2022-01-24T13:47:25+00:00