Ethnic Groups
preferred label: Ethnische Gruppen @de

Greeks
preferred label: Griechen @de

Minyans
type: Concept
in scheme: scheme
preferred label: Minyer @de
broader: Ethnic Groups
related: Greeks
change note:
  comment: initial version
  created: 2021-04-23T09:08:36+00:00
  creator: Elena Chestnova
change note:
  creator: Elena Chestnova
  modified: 2021-04-23T09:09:40+00:00
definition: Mythical ancient inhabitants of the Aegean region.
change note:
  creator: Elena Chestnova
  modified: 2022-06-17T10:42:47+00:00
notation: PEOPLE0140