theoretical terms
preferred label: theoretische Begriffe @de

Pegma
type: Concept
in scheme: scheme
broader: theoretical terms
change note:
  creator: Elena Chestnova
  modified: 2021-05-06T13:21:27+00:00
change note:
  comment: initial version
  created: 2021-05-03T10:32:51+00:00
  creator: Tanja Kevic
definition: In Semper's use "pegma" denotes works of carpentry, so he speaks of furniture and timbel elements (e.g. columns) as pegmata.
change note:
  creator: Elena Chestnova
  modified: 2022-06-14T09:40:19+00:00
notation: TERM0018