People in literature
preferred label: Personen in der Literatur @de

Travel writer
preferred label: Reiseschriftsteller @de

Author
type: Concept
in scheme: scheme
preferred label: Schriftsteller @de
alternative label: Auteur @fr
alternative label: Autore @it
alternative label: compos.
alternative label: componere
alternative label: posui
alternative label: posuit
alternative label: scribeb.
broader: People in literature
narrower: Travel writer
related: Travel writer
change note:
  creator: Michael Matile
  modified: 2022-01-24T16:16:17+00:00
change note:
  comment: initial version @en
  created: 2021-05-19T08:55:54+00:00
  creator: Sophie Guermann
change note:
  creator: Sophie Guermann
  modified: 2021-06-01T07:52:45+00:00
change note:
  creator: Sophie Guermann
  modified: 2021-08-01T12:31:58+00:00
scope note: Bezeichnet ist damit die Person (Schriftsteller/Autor), von welcher der gedruckte Text stammt. @de
change note:
  creator: Michael Matile
  modified: 2022-01-24T16:24:00+00:00
change note:
  creator: Florian Kräutli
  modified: 2022-08-24T14:27:08+00:00
related match: E65 Creation