Privileges
preferred label: Privilegien @de

With privilege
type: Concept
in scheme: scheme
preferred label: Mit Privileg @de
alternative label: Avec privilège @fr
alternative label: Con il privilegio @it
alternative label: cum p.
alternative label: cum pr.
alternative label: cum privil.
alternative label: cum privilegio
alternative label: prvil.
alternative label: privilegiatus
alternative label: privilegio
alternative label: privilegium
alternative label: cum grat. et priv.
alternative label: cum gratia & privil.
alternative label: cum gratia & privilegio
alternative label: cum gratia et priv.
alternative label: cum gratia et privilegio
broader: Privileges
change note:
  creator: Sophie Guermann
  modified: 2021-09-16T09:24:02+00:00
change note:
  creator: Sophie Guermann
  modified: 2021-09-14T14:13:41+00:00
change note:
  comment: initial version @en
  created: 2021-09-14T14:11:25+00:00
  creator: Sophie Guermann
change note:
  creator: Michael Matile
  modified: 2022-01-26T13:37:49+00:00
scope note: Bezeichnet ein gedrucktes Werk, für welches ein Druckprivileg ausgestellt wurde. @de