Draughtsman
preferred label: Zeichner @de

Art Processes and techniques
preferred label: Künstlerische Prozesse und Techniken @de

drawing
type: Concept
in scheme: scheme
preferred label: zeichnen @de
alternative label: drawn @en
alternative label: design. @en
alternative label: gezeichnet von @de
alternative label: gez. von @de
alternative label: dessiner @fr
alternative label: dessiné @fr
alternative label: dessin. par @fr
alternative label: deliné @fr
alternative label: disegnare @it
alternative label: delineatus
alternative label: delineati
alternative label: delineatae
alternative label: de.
alternative label: del.
alternative label: delin.
alternative label: delineavit
alternative label: fig.
alternative label: figur.
alternative label: figurabat
alternative label: figuravit
alternative label: invenire
alternative label: invenit
alternative label: inv.
related: Draughtsman
broader: Art Processes and techniques
change note:
  creator: Michael Matile
  modified: 2022-01-24T13:40:03+00:00
change note:
  creator: Michael Matile
  modified: 2021-10-31T12:10:34+00:00
change note:
  creator: Michael Matile
  modified: 2021-10-19T11:33:11+00:00
change note:
  creator: Michael Matile
  modified: 2021-10-19T08:13:22+00:00
change note:
  creator: Michael Matile
  modified: 2021-10-19T07:12:49+00:00
change note:
  comment: initial version @en
  created: 2021-06-02T08:12:42+00:00
  creator: Sophie Guermann
change note:
  creator: Michael Matile
  modified: 2021-10-19T07:05:33+00:00
change note:
  creator: Michael Matile
  modified: 2021-10-19T07:23:37+00:00
change note:
  creator: Michael Matile
  modified: 2022-01-24T13:36:59+00:00
scope note: Bezeichnet die künstlerische Tätigkeit des Zeichnens - in englischer Sprache auch das Produkt derselben. @de
change note:
  creator: Michael Matile
  modified: 2022-01-24T13:44:30+00:00