Infula
type: Concept
in scheme: scheme
broader: Headbands
change note:
  comment: initial version
  created: 2021-05-26T10:22:43+00:00
  creator: Elena Chestnova
definition: Semper means this in the Roman sense as a band of wool worn around the head on solemn occasions (see Style vol. 1. ed. 1. p. 25).
change note:
  creator: Elena Chestnova
  modified: 2022-06-17T12:24:01+00:00
notation: THING0383