Project
type: Concept
in scheme: scheme
broader: Œuvre
change note:
  comment: initial version
  created: 2021-05-05T14:08:04+00:00
  creator: Thomas Hänsli
definition: An (architectural) project as an conceptual expression of a given œuvre.