Printseller
preferred label: Kupferstichhändler @de

Address
preferred label: Adresse @de

Printshop
type: Concept
in scheme: scheme
preferred label: Druckerei @de
alternative label: Imprimerie @fr
alternative label: Stamperia @it
alternative label: off. @la
alternative label: officina @la
related: Printseller
broader: Address
related: Address
change note:
  creator: Sophie Guermann
  modified: 2021-09-13T13:49:36+00:00
change note:
  comment: initial version
  created: 2021-08-01T11:51:27+00:00
  creator: Sophie Guermann
change note:
  creator: Michael Matile
  modified: 2022-01-24T15:06:30+00:00
scope note: Bezeichnet die Druckerei, in welcher die Druckgraphik gedruckt wurde. @de