People
preferred label: Personen @de

Author
preferred label: Schriftsteller @de

People in literature
type: Concept
in scheme: scheme
preferred label: Personen in der Literatur @de
alternative label: Les acteurs de la littérature @fr
alternative label: Persone in letteratura @it
broader: People
narrower: Author
change note:
  creator: Sophie Guermann
  modified: 2021-09-13T13:50:46+00:00
change note:
  comment: initial version
  created: 2021-05-19T08:49:04+00:00
  creator: Sophie Guermann
change note:
  creator: Michael Matile
  modified: 2022-01-24T16:14:33+00:00
scope note: Gemeint sind literarisch tätige Personen, Autoren/Schriftsteller etc. @de
change note:
  creator: Florian Kräutli
  modified: 2022-08-24T13:45:41+00:00