Drucker
preferred label: Printer @en

Adresse
preferred label: Address @en

Lithographische Druckerei
type: Concept
in scheme: scheme
preferred label: Lithographic printshop @en
alternative label: lith. Inst.
alternative label: lith. Institut
alternative label: Lith. u. Druck
alternative label: lithographische Anstalt
alternative label: lithographisches Atelier
alternative label: lithographisches Institut
alternative label: Steindruckerei
alternative label: Imprimerie lithographique @fr
alternative label: Stampa litografica @it
related: Drucker
broader: Adresse
change note:
  creator: Sophie Guermann
  modified: 2021-09-16T09:13:10+00:00
change note:
  creator: Sophie Guermann
  modified: 2021-09-14T08:46:23+00:00
change note:
  creator: Sophie Guermann
  modified: 2021-09-13T14:46:01+00:00
change note:
  creator: Sophie Guermann
  modified: 2021-08-01T12:37:02+00:00
change note:
  comment: initial version @en
  created: 2021-08-01T11:13:22+00:00
  creator: Sophie Guermann
change note:
  creator: Sophie Guermann
  modified: 2021-09-14T08:17:45+00:00
change note:
  creator: Michael Matile
  modified: 2022-01-24T14:42:23+00:00
scope note: Bezeichnet die Lithographieanstalt, in welcher die Lithographie gedruckt wurde. @en