Artists by activity, medium or work type
preferred label: Künstler nach Tätigkeit, Medium oder Werkart @de

Painting
preferred label: Gemälde @de

Painter
type: Concept
in scheme: scheme
preferred label: Maler @de
alternative label: painted @en
alternative label: gemahlt von @de
alternative label: gemalt von @de
alternative label: Peintre @fr
alternative label: peint par @fr
alternative label: Pittore @it
alternative label: depingebat
alternative label: depinxit
alternative label: dipin.
alternative label: dipins.
alternative label: pict.
alternative label: pictor
alternative label: pictrix
alternative label: pin.
alternative label: pingebat
alternative label: pins.
alternative label: pintado
alternative label: pinx.
alternative label: pinxcit
alternative label: pinxer. [= plural]
alternative label: pinxit
alternative label: pinxt.
alternative label: pittore
alternative label: pt.
alternative label: px.
broader: Artists by activity, medium or work type
related: Painting
change note:
  creator: Michael Matile
  modified: 2022-01-24T14:18:13+00:00
change note:
  comment: initial version @en
  created: 2021-05-19T07:59:23+00:00
  creator: Sophie Guermann
change note:
  creator: Sophie Guermann
  modified: 2021-06-01T09:07:50+00:00
scope note: Bezeichnet den Urheber eines Gemäldes. @de
change note:
  creator: Florian Kräutli
  modified: 2022-03-25T11:59:05+00:00
related match: E65 Creation