Art Processes and techniques
preferred label: Künstlerische Prozesse und Techniken @de

Colorist
preferred label: Kolorist @de

coloring
type: Concept
in scheme: scheme
preferred label: kolorieren @de
alternative label: coloriage @fr
alternative label: colorare @it
broader: Art Processes and techniques
related: Colorist
change note:
  creator: Michael Matile
  modified: 2022-01-24T10:20:26+00:00
change note:
  creator: Michael Matile
  modified: 2021-10-31T11:25:06+00:00
change note:
  comment: initial version
  created: 2021-06-02T06:27:42+00:00
  creator: Sophie Guermann
scope note: Bezeichnet das Kolorieren von Hand mit Pinsel, meist mit Wasserfarben oder Gouache, eines druckgraphischen Blattes (Kupferstich, Radierung etc.) @de
change note:
  creator: Michael Matile
  modified: 2022-01-24T13:46:00+00:00