Privileges
preferred label: Privilegien @de

With royal privilege
type: Concept
in scheme: scheme
preferred label: Mit königlichem Privileg @de
alternative label: Avec privilège royal
alternative label: avec priv. du roi
alternative label: avec privil. du roy
alternative label: avec privilege
alternative label: avec privilege du roi
alternative label: avec privilege du roy
alternative label: Con il privilegio reale @it
broader: Privileges
change note:
  comment: initial version @en
  created: 2021-06-02T09:55:25+00:00
  creator: Sophie Guermann
change note:
  creator: Michael Matile
  modified: 2022-01-26T13:35:33+00:00
scope note: Bezeichnet gedruckte Werke, für welche ein königliches Druckprivileg ausgestellt wurde. @de