Proofs
preferred label: Andrucke @de

Printer's proof
type: Concept
in scheme: scheme
preferred label: Abzug des Druckers @de
alternative label: PP
alternative label: Épreuve de l'imprimeur @fr
alternative label: Esemplare del stampatore @it
broader: Proofs
change note:
  creator: Michael Matile
  modified: 2022-01-26T10:35:31+00:00
change note:
  comment: initial version
  created: 2021-08-01T11:55:01+00:00
  creator: Sophie Guermann
scope note: Analog zum Begriff 'Artist's proof' ist damit ein Abzug aus der für den Drucker reservierten Auflage gemeint. Der Begriff sollte nur im Fall von handschriftlich nummerierter Druckgrafik verwendet werden. @de
change note:
  creator: Michael Matile
  modified: 2022-01-26T13:11:15+00:00