Built Work
type: Concept
in scheme: scheme
preferred label: Gebautes Werk @de
broader: Œuvre
change note:
  comment: initial version
  created: 2021-05-05T14:06:37+00:00
  creator: Thomas Hänsli
definition: Relates to built works as one form of expression of an œuvres