Engraving
preferred label: Stich @de

Steel engraver
preferred label: Stahlstecher @de

Steel engraving
type: Concept
in scheme: scheme
preferred label: Stahlstich @de
alternative label: Gravure sur acier @fr
alternative label: Incisione in accaio @it
broader: Engraving
related: Steel engraver
change note:
  comment: initial version
  created: 2022-02-01T14:15:58+00:00
  creator: Michael Matile
scope note: Bezeichnet einen Stich, der in Stahl (nicht Kupfer) gestochen wurde. @de