People by activity, in commerce and business
preferred label: Personen nach Tätigkeit, in Handel und Gewerbe @de

Patron
preferred label: Mäzen @de

Philanthropist
type: Concept
in scheme: scheme
preferred label: Philanthrop @de
alternative label: Philanthrope @fr
alternative label: Filantropo @it
broader: People by activity, in commerce and business
related: Patron
change note:
  creator: Sophie Guermann
  modified: 2021-05-25T07:59:15+00:00
change note:
  comment: initial version
  created: 2021-05-25T07:19:54+00:00
  creator: Sophie Guermann
change note:
  creator: Michael Matile
  modified: 2022-01-24T16:04:36+00:00
scope note: Bezeichnet eine selbstlose, der Allgemeinheit freundlich gesinnte Person, welche zu deren Wohl Gutes tut und/oder finanziert. @de
change note:
  creator: Florian Kräutli
  modified: 2022-08-24T14:26:11+00:00
related match: E12 Production