Trial proof
preferred label: Probedruck @de

Inscription
preferred label: Beischrift @de

Without text
type: Concept
in scheme: scheme
preferred label: Ohne Text @de
alternative label: Without any text
alternative label: without letterpress
alternative label: Sans texte @fr
alternative label: Sans aucune lettre @fr
alternative label: sans lettre @fr
alternative label: Senza testo @it
alternative label: Senza lettera @it
related: Trial proof
broader: Inscription
change note:
  creator: Sophie Guermann
  modified: 2021-10-19T07:39:57+00:00
change note:
  creator: Sophie Guermann
  modified: 2021-08-01T12:59:46+00:00
change note:
  creator: Sophie Guermann
  modified: 2021-08-01T12:35:38+00:00
change note:
  comment: initial version
  created: 2021-08-01T12:20:04+00:00
  creator: Sophie Guermann
change note:
  creator: Sophie Guermann
  modified: 2021-09-14T06:13:29+00:00
change note:
  creator: Michael Matile
  modified: 2022-01-24T15:19:27+00:00
scope note: Bezeichnet einen (Probe)druck ohne die Beischrift(en) späterer Druckzustände. @de