Inscription
preferred label: Beischrift @de

Dedication
type: Concept
in scheme: scheme
preferred label: Widmung @de
alternative label: gewidmet von @de
alternative label: zu Ehren @de
alternative label: zugeeignet von @de
alternative label: Dédicace @fr
alternative label: dedié par @fr
alternative label: dediée par @fr
alternative label: Dedicazione @it
alternative label: consec.
alternative label: consecrat
alternative label: dedicavit
alternative label: dicat
alternative label: dicavit
alternative label: offerebat
alternative label: offert
alternative label: sacravit
broader: Inscription
related: Inscription
change note:
  creator: Sophie Guermann
  modified: 2021-09-13T14:25:19+00:00
change note:
  creator: Sophie Guermann
  modified: 2021-06-14T10:03:41+00:00
change note:
  comment: initial version @en
  created: 2021-06-14T09:10:51+00:00
  creator: Sophie Guermann
change note:
  creator: Michael Matile
  modified: 2022-01-24T15:07:59+00:00
scope note: Bezeichnet eine Beischrift auf einer Druckgraphik, welche eine Widmung des Künstlers, Herausgebers oder Druckers an eine Persönlichkeit enthält. @de