Cochineal (colorant)
preferred label: Hochrotfarbe @de

Cochineal (insect)
type: Concept
in scheme: scheme
preferred label: Cochenille @de
alternative label: Dactylopius coccus @la
related: Cochineal (colorant)
broader: Living organisms
change note:
  comment: initial version
  created: 2021-05-27T14:09:13+00:00
  creator: Elena Chestnova
definition: "Scale insect from which the crimson colorant cochineal is derived. It is a primarily sessile parasite native to tropical and subtropical South America and Mexico, preferring cacti from the genus Opuntia. It produces carminic acid, which deters predation. This substance is extracted from the bodies of dry females and eggs; the colorant was usually used as a red solution or precipitated to make carmine, an aluminum or aluminum-tin lake. Secretions of sticky, weblike strands of filamentous wax make the colonies' infestations on the cacti appear as furry white patches." Source: AAT
change note:
  creator: Elena Chestnova
  modified: 2021-05-27T14:20:30+00:00