Built Work
preferred label: Gebautes Werk @de

Œuvre
type: Concept
in scheme: scheme
broader: Œuvres Types
narrower: Built Work
narrower: Project
change note:
  comment: initial version
  created: 2021-05-05T14:04:41+00:00
  creator: Thomas Hänsli
definition: Referring to the totality of an œuvre, including projects, built works and related conceptual phases