Egyptians
preferred label: Ägypter @de

Arabs
preferred label: Araber @de

Fellahs
type: Concept
in scheme: scheme
preferred label: Fellache @de
related: Egyptians
broader: Social groups
related: Arabs
change note:
  comment: initial version
  created: 2021-04-23T08:25:53+00:00
  creator: Elena Chestnova
definition: Term used to describe peasants in colonial Middle East and North Africa.
change note:
  creator: Elena Chestnova
  modified: 2022-06-16T17:01:14+00:00
notation: PEOPLE0100