Inscription
preferred label: Beischrift @de

Engraver
preferred label: Stecher @de

Letter engraver
type: Concept
in scheme: scheme
preferred label: Schriftstecher @de
alternative label: Graveur de lettres @fr
alternative label: Incisore di lettere @it
alternative label: sc. sc. @la
alternative label: scrip. @la
alternative label: scrips. @la
alternative label: scripsit @la
related: Inscription
broader: Engraver
change note:
  creator: Michael Matile
  modified: 2021-10-30T13:25:12+00:00
change note:
  comment: initial version
  created: 2021-08-01T12:23:25+00:00
  creator: Sophie Guermann
scope note: Die Person, welche für das Stechen von Beischriften im Herstellungsprozess einer Druckgraphik verantwortlich ist @de
change note:
  creator: Michael Matile
  modified: 2022-01-24T14:11:52+00:00