primary
preferred label: primär beteiligte Person @de

secondary
preferred label: sekundäre beteiligte Person @de

Participant
type: Concept
in scheme: scheme
preferred label: Beteiligte Person @de
broader: BSO Thesaurus
narrower: primary
narrower: secondary
change note:
  comment: initial version
  created: 2022-08-24T09:39:29+00:00
  creator: Michael Matile
scope note: Meint eine beteiligte Person, sei es als Lehrer oder Schüler, oder sei es als Gastgeber oder Gast @de