Artists by activity, medium or work type
preferred label: Künstler nach Tätigkeit, Medium oder Werkart @de

drawing
preferred label: zeichnen @de

Draughtsman
type: Concept
in scheme: scheme
preferred label: Zeichner @de
alternative label: draw @en
alternative label: drawn @en
alternative label: gez. von @de
alternative label: gezeichnet von @de
alternative label: gz. @de
alternative label: Dessinateur @fr
alternative label: dess. par @fr
alternative label: desseignez par @fr
alternative label: dessigné par @fr
alternative label: dessignée par @fr
alternative label: dessignéz par @fr
alternative label: dessin. par @fr
alternative label: dessiné par @fr
alternative label: dessinée @fr
alternative label: dessinés @fr
alternative label: Disegnatore @it
alternative label: d.
alternative label: de.
alternative label: del.
alternative label: del.t
alternative label: deli.
alternative label: delie.
alternative label: delien.
alternative label: delin.
alternative label: deliné
alternative label: delineata
alternative label: delineatae
alternative label: delineati
alternative label: delineator
alternative label: delineatus
alternative label: delineavit
alternative label: dell.
alternative label: descripsit
alternative label: desig.
alternative label: design.
alternative label: designatum
alternative label: designavit
alternative label: dis.
alternative label: diseg.te
alternative label: disegno
alternative label: effig.
alternative label: effigiavit
alternative label: effigiebat
alternative label: fig.
alternative label: figu.
alternative label: figur.
alternative label: figura.
alternative label: figurabat
alternative label: figurat.
alternative label: figuravit
alternative label: lineavit
alternative label: revis’d
broader: Artists by activity, medium or work type
related: drawing
change note:
  creator: Michael Matile
  modified: 2022-01-24T14:07:30+00:00
change note:
  creator: Michael Matile
  modified: 2021-10-05T12:47:37+00:00
change note:
  creator: Sophie Guermann
  modified: 2021-05-25T14:01:56+00:00
change note:
  comment: initial version @en
  created: 2021-05-19T06:39:21+00:00
  creator: Sophie Guermann
change note:
  creator: Sophie Guermann
  modified: 2021-07-26T06:29:11+00:00
change note:
  creator: Sophie Guermann
  modified: 2021-08-01T12:18:41+00:00
change note:
  creator: Michael Matile
  modified: 2021-10-19T07:02:30+00:00
scope note: Bezeichnet die Person des Zeichners. Bei druckgraphischen Blättern bedeutet die Angabe des Zeichners in der Regel auch, dass das Blatt nach der gezeichneten Vorlage dieses Künstler gestochen wurde. Der Stecher wird entsprechend mit dem Zusatz "fec.", "sculp." oder ähnlich angegeben. @de
change note:
  creator: Florian Kräutli
  modified: 2022-02-21T15:07:39+00:00
related match: E65 Creation